{"text_format":"3","workbook":"xlsx","n_sheets":3,"sheets":["Sheet1","Sheet2","Sheet3"],"not_rendered":{"external_links":2,"defined_names":1},"read":"whole","date_system":"1900"}

{"sheet":"Sheet1","index":0,"n_rows":8,"n_cols":14,"rows_kept":8}
["D","ExpiryDate","LotQty","CNCMargin\n(in%)","CNCMargin\n(inRs)","CNCExposure\n(inX)","RegularIntraday\nExposure(inX)","PremiumIntraday\nExposure(inX)","RegularBO\nExposure(inX)","PremiumBO\nExposure(inX)","RegularIntraday\nExposure(inRs)","PremiumIntraday\nExposure(inRs)","RegularBO\nExposure(inRs)","PremiumBO\nExposure(inRs)"]
["GBPUSD",{"$f":"VLOOKUP(A2,[1]Sheet1!$A$2:$C$9,3,0)","v":"2023-04-26"},1000,{"$f":"VLOOKUP(A2,[2]Sheet1!$A$1:$J$22,10,0)","v":4.75},{"$f":"VLOOKUP(A2,[2]Sheet1!$A$1:$I$22,9,0)","v":{"v":4842.425,"d":"4842"}},1,1,1,1,1,{"$f":"E2","v":{"v":4842.425,"d":"4842"}},{"$f":"E2","v":{"v":4842.425,"d":"4842"}},{"$f":"E2","v":{"v":4842.425,"d":"4842"}},{"$f":"E2","v":{"v":4842.425,"d":"4842"}}]
["GBPINR",{"$f":"VLOOKUP(A3,[1]Sheet1!$A$2:$C$9,3,0)","v":"2023-04-26"},1000,{"$f":"VLOOKUP(A3,[2]Sheet1!$A$1:$J$22,10,0)","v":3.91},{"$f":"VLOOKUP(A3,[2]Sheet1!$A$1:$I$22,9,0)","v":{"v":3985.785,"d":"3986"}},1,1,1,1,1,{"$f":"E3","v":{"v":3985.785,"d":"3986"}},{"$f":"E3","v":{"v":3985.785,"d":"3986"}},{"$f":"E3","v":{"v":3985.785,"d":"3986"}},{"$f":"E3","v":{"v":3985.785,"d":"3986"}}]
["JPYINR",{"$f":"VLOOKUP(A4,[1]Sheet1!$A$2:$C$9,3,0)","v":"2023-04-26"},1000,{"$f":"VLOOKUP(A4,[2]Sheet1!$A$1:$J$22,10,0)","v":4.54},{"$f":"VLOOKUP(A4,[2]Sheet1!$A$1:$I$22,9,0)","v":{"v":2778.7,"d":"2779"}},1,1,1,1,1,{"v":2778.7,"d":"2779"},{"v":2778.7,"d":"2779"},{"v":2778.7,"d":"2779"},{"v":2778.7,"d":"2779"}]
["USDJPY",{"$f":"VLOOKUP(A5,[1]Sheet1!$A$2:$C$9,3,0)","v":"2023-04-26"},1000,{"$f":"VLOOKUP(A5,[2]Sheet1!$A$1:$J$22,10,0)","v":5.25},{"$f":"VLOOKUP(A5,[2]Sheet1!$A$1:$I$22,9,0)","v":{"v":4292.105,"d":"4292"}},1,1,1,1,1,{"v":4292.105,"d":"4292"},{"v":4292.105,"d":"4292"},{"v":4292.105,"d":"4292"},{"v":4292.105,"d":"4292"}]
["EURUSD",{"$f":"VLOOKUP(A6,[1]Sheet1!$A$2:$C$9,3,0)","v":"2023-04-26"},1000,{"$f":"VLOOKUP(A6,[2]Sheet1!$A$1:$J$22,10,0)","v":4.09},{"$f":"VLOOKUP(A6,[2]Sheet1!$A$1:$I$22,9,0)","v":{"v":3686.3775,"d":"3686"}},1,1,1,1,1,{"v":3686.3775,"d":"3686"},{"v":3686.3775,"d":"3686"},{"v":3686.3775,"d":"3686"},{"v":3686.3775,"d":"3686"}]
["EURINR",{"$f":"VLOOKUP(A7,[1]Sheet1!$A$2:$C$9,3,0)","v":"2023-04-26"},1000,{"$f":"VLOOKUP(A7,[2]Sheet1!$A$1:$J$22,10,0)","v":3.11},{"$f":"VLOOKUP(A7,[2]Sheet1!$A$1:$I$22,9,0)","v":{"v":2810.12875,"d":"2810"}},1,1,1,1,1,{"v":2810.12875,"d":"2810"},{"v":2810.12875,"d":"2810"},{"v":2810.12875,"d":"2810"},{"v":2810.12875,"d":"2810"}]
["USDINR",{"$f":"VLOOKUP(A8,[1]Sheet1!$A$2:$C$9,3,0)","v":"2023-04-26"},1000,{"$f":"VLOOKUP(A8,[2]Sheet1!$A$1:$J$22,10,0)","v":{"v":2.3200000000000003,"d":"2.32"}},{"$f":"VLOOKUP(A8,[2]Sheet1!$A$1:$I$22,9,0)","v":{"v":1897.45,"d":"1897"}},1,1,1,1,1,{"v":1897.45,"d":"1897"},{"v":1897.45,"d":"1897"},{"v":1897.45,"d":"1897"},{"v":1897.45,"d":"1897"}]

{"sheet":"Sheet2","index":1,"n_rows":0,"n_cols":0,"rows_kept":0}

{"sheet":"Sheet3","index":2,"n_rows":0,"n_cols":0,"rows_kept":0}